Reaction Details
TargetGonadotropin-releasing hormone receptor
LigandBDBM50085763
Substrate/Competitorn/a
Meas. Tech.ChEMBL_71751 (CHEMBL680273)
Ki 0.57±n/a nM
Citation Rivier, JEPorter, JCervini, LALahrichi, SLKirby, DAStruthers, RSKoerber, SCRivier, CL Design of monocyclic (1-3) and dicyclic (1-3/4-10) gonadotropin releasing hormone (GnRH) antagonists. J Med Chem43:797-806 (2000) Gonadotropin-releasing hormone receptor
Name:Gonadotropin-releasing hormone receptor
Type:PROTEIN
Mol. Mass.:37767.60
Organism:Rattus norvegicus
Description:ChEMBL_1335047
Residue:327
BDBM50085763
NameBDBM50085763
Synonyms:CHEMBL264291 | cyclo(1-3)Ac-D-Asp (D-Ala)-D-Cpa-D-Dbu-Ser-Tyr-D-Nal-Leu-Arg-Pro-D-Ala-NH2
TypeSmall organic molecule
Emp. Form.C71H97ClN16O15
Mol. Mass.1450.081
SMILESCCCCC1C[C@@H](NC(=O)[C@@H](C)NC(=O)CC(NC(C)=O)C(=O)N[C@H](Cc2ccc(Cl)cc2)C(=O)N1)C(=O)N[C@@H](CO)C(=O)N[C@@H](Cc1ccc(O)cc1)C(=O)NC(Cc1ccc2ccccc2c1)C(=O)N[C@H](CC(C)C)C(=O)N[C@@H](CCCNC(N)=N)C(=O)N1CCC[C@@H]1C(=O)NC(C)C(N)=O