Reaction Details
TargetGonadotropin-releasing hormone receptor
LigandBDBM50085815
Substrate/Competitorn/a
Meas. Tech.ChEMBL_71869 (CHEMBL877834)
Ki 0.27±n/a nM
Citation Koerber, SCRizo, JStruthers, RSRivier, JE Consensus bioactive conformation of cyclic GnRH antagonists defined by NMR and molecular modeling. J Med Chem43:819-28 (2000) Gonadotropin-releasing hormone receptor
Name:Gonadotropin-releasing hormone receptor
Type:Enzyme
Mol. Mass.:37749.45
Organism:Homo sapiens (Human)
Description:P30968
Residue:328
BDBM50085815
NameBDBM50085815
Synonyms:CHEMBL269726 | cyclo(4-10)[Ac-3Pro-DFpa-DTrp-c[Asp-Tyr-D2Nal-Leu-Arg-Pro-Dpr-NH2]
TypeSmall organic molecule
Emp. Form.C73H87FN16O13
Mol. Mass.1415.5697
SMILESCC(C)C[C@@H]1NC(=O)[C@H](Cc2ccc3ccccc3c2)NC(=O)[C@H](Cc2ccc(O)cc2)NC(=O)[C@H](CC(=O)NC[C@H](NC(=O)[C@@H]2CCCN2C(=O)[C@@H](CCCNC(N)=N)NC1=O)C(N)=O)NC(=O)[C@@H](Cc1c[nH]c2ccccc12)NC(=O)[C@@H](Cc1ccc(F)cc1)NC(=O)[C@H]1C=CCN1C(C)=O