Reaction Details
TargetProtein kinase C alpha type
LigandBDBM50085900
Substrate/Competitorn/a
Meas. Tech.ChEMBL_161416 (CHEMBL766516)
Ki 164±n/a nM
Citation Nacro, KBienfait, BLee, JHan, KCKang, JHBenzaria, SLewin, NEBhattacharyya, DKBlumberg, PMMarquez, VE Conformationally constrained analogues of diacylglycerol (DAG). 16. How much structural complexity is necessary for recognition and high binding affinity to protein kinase C? J Med Chem43:921-44 (2000) Protein kinase C alpha type
Name:Protein kinase C alpha type
Type:Enzyme
Mol. Mass.:76755.65
Organism:Homo sapiens (Human)
Description:The recombinant human PKC enzymes were produced using a baculovirus expression system in SF9 cells
Residue:672
BDBM50085900
NameBDBM50085900
Synonyms:3-Isopropyl-4-methyl-pentanoic acid 4-ethylidene-2-hydroxymethyl-5-oxo-tetrahydro-furan-2-ylmethyl ester | CHEMBL173414
TypeSmall organic molecule
Emp. Form.C17H28O5
Mol. Mass.312.4012
SMILESC\C=C1\CC(CO)(COC(=O)CC(C(C)C)C(C)C)OC1=O