Reaction Details
TargetProtein kinase C alpha type
LigandBDBM50085907
Substrate/Competitorn/a
Meas. Tech.ChEMBL_161416 (CHEMBL766516)
Ki 30±n/a nM
Citation Nacro, KBienfait, BLee, JHan, KCKang, JHBenzaria, SLewin, NEBhattacharyya, DKBlumberg, PMMarquez, VE Conformationally constrained analogues of diacylglycerol (DAG). 16. How much structural complexity is necessary for recognition and high binding affinity to protein kinase C? J Med Chem43:921-44 (2000) Protein kinase C alpha type
Name:Protein kinase C alpha type
Type:Enzyme
Mol. Mass.:76755.65
Organism:Homo sapiens (Human)
Description:The recombinant human PKC enzymes were produced using a baculovirus expression system in SF9 cells
Residue:672
BDBM50085907
NameBDBM50085907
Synonyms:3-[2-Hydroxymethyl-4-(3-isopropyl-4-methyl-pentylidene)-5-oxo-tetrahydro-furan-2-yl]-acrylic acid hexyl ester | CHEMBL368472
TypeSmall organic molecule
Emp. Form.C23H38O5
Mol. Mass.394.5448
SMILESCCCCCCOC(=O)\C=C\[C@]1(CO)C\C(=C/CC(C(C)C)C(C)C)C(=O)O1