Reaction Details
TargetProstaglandin E2 receptor EP1 subtype
LigandBDBM50085909
Substrate/Competitorn/a
Meas. Tech.ChEMBL_158172 (CHEMBL766135)
IC50 713±n/a nM
Citation Wang, YWos, JADirr, MJSoper, DLdeLong, MAMieling, GEDe, BAmburgey, JSSuchanek, EGTaylor, CJ Design and synthesis of 13,14-dihydro prostaglandin F(1alpha) analogues as potent and selective ligands for the human FP receptor. J Med Chem43:945-52 (2000) Prostaglandin E2 receptor EP1 subtype
Name:Prostaglandin E2 receptor EP1 subtype
Type:Enzyme
Mol. Mass.:41834.57
Organism:Homo sapiens (Human)
Description:P34995
Residue:402
BDBM50085909
NameBDBM50085909
Synonyms:7-[3,5-Dihydroxy-2-(3-hydroxy-4-phenoxy-butyl)-cyclopentyl]-heptanoic acid | CHEMBL425681
TypeSmall organic molecule
Emp. Form.C22H34O6
Mol. Mass.394.5018
SMILESO[C@H](CC[C@H]1[C@H](O)C[C@H](O)[C@@H]1CCCCCCC(O)=O)COc1ccccc1