Reaction Details
TargetProstaglandin F2-alpha receptor
LigandBDBM50085920
Substrate/Competitorn/a
Meas. Tech.ChEMBL_158455 (CHEMBL763259)
IC50 320±n/a nM
Citation Wang, YWos, JADirr, MJSoper, DLdeLong, MAMieling, GEDe, BAmburgey, JSSuchanek, EGTaylor, CJ Design and synthesis of 13,14-dihydro prostaglandin F(1alpha) analogues as potent and selective ligands for the human FP receptor. J Med Chem43:945-52 (2000) Prostaglandin F2-alpha receptor
Name:Prostaglandin F2-alpha receptor
Type:Enzyme
Mol. Mass.:40072.29
Organism:Homo sapiens (Human)
Description:P43088
Residue:359
BDBM50085920
NameBDBM50085920
Synonyms:7-{3,5-Dihydroxy-2-[3-hydroxy-4-(3-trifluoromethyl-phenylsulfanyl)-butyl]-cyclopentyl}-heptanoic acid | CHEMBL172250
TypeSmall organic molecule
Emp. Form.C23H33F3O5S
Mol. Mass.478.565
SMILESOC(CC[C@H]1[C@H](O)C[C@H](O)[C@@H]1CCCCCCC(O)=O)CSc1cccc(c1)C(F)(F)F