Reaction Details
Target5-hydroxytryptamine receptor 3A
LigandBDBM50014406
Substrate/Competitorn/a
Meas. Tech.ChEMBL_3466 (CHEMBL872927)
Ki 1200±n/a nM
Citation Glennon, RALee, MRangisetty, JBDukat, MRoth, BLSavage, JEMcBride, ARauser, LHufeisen, SLee, DK 2-Substituted tryptamines: agents with selectivity for 5-HT(6) serotonin receptors. J Med Chem43:1011-8 (2000) 5-hydroxytryptamine receptor 3A
Name:5-hydroxytryptamine receptor 3A
Type:Protein
Mol. Mass.:55283.27
Organism:Homo sapiens (Human)
Description:P46098
Residue:478
BDBM50014406
NameBDBM50014406
Synonyms:2-Me 5-HT 2-methyl-5-HT 3-(2-aminoethyl)-2-methyl-1H-indol-5-ol CHEMBL266591
TypeSmall organic molecule
Emp. Form.C11H14N2O
Mol. Mass.190.2417
SMILESCc1[nH]c2ccc(O)cc2c1CCN