Reaction Details
Target5-hydroxytryptamine receptor 6
LigandBDBM50085978
Substrate/Competitorn/a
Meas. Tech.ChEMBL_3619 (CHEMBL618122)
Ki 185±n/a nM
Citation Glennon, RALee, MRangisetty, JBDukat, MRoth, BLSavage, JEMcBride, ARauser, LHufeisen, SLee, DK 2-Substituted tryptamines: agents with selectivity for 5-HT(6) serotonin receptors. J Med Chem43:1011-8 (2000) 5-hydroxytryptamine receptor 6
Name:5-hydroxytryptamine receptor 6
Type:G Protein-Coupled Receptor (GPCR)
Mol. Mass.:46968.43
Organism:Homo sapiens (Human)
Description:P50406
Residue:440
BDBM50085978
NameBDBM50085978
Synonyms:CHEMBL7379 [2-(5-Methoxy-2-propyl-1H-indol-3-yl)-ethyl]-dimethyl-amine (C2H2O4)
TypeSmall organic molecule
Emp. Form.C16H24N2O
Mol. Mass.260.3746
SMILESCCCc1[nH]c2ccc(OC)cc2c1CCN(C)C