Reaction Details
TargetCytosolic phospholipase A2
LigandBDBM50085984
Substrate/Competitorn/a
Meas. Tech.ChEMBL_217519 (CHEMBL820842)
IC50 2.1±n/a nM
Citation Seno, KOkuno, TNishi, KMurakami, YWatanabe, FMatsuura, TWada, MFujii, YYamada, MOgawa, TOkada, THashizume, HKii, MHara, SHagishita, SNakamoto, SYamada, KChikazawa, YUeno, MTeshirogi, IOno, TOhtani, M Pyrrolidine inhibitors of human cytosolic phospholipase A(2). J Med Chem43:1041-4 (2000) Cytosolic phospholipase A2
Name:Cytosolic phospholipase A2
Type:Protein
Mol. Mass.:85219.30
Organism:Homo sapiens (Human)
Description:P47712
Residue:749
BDBM50085984
NameBDBM50085984
Synonyms:CHEMBL9161 | N-[1-[2-(2,4-Difluoro-benzoyl)-benzoyl]-4-(3-isobutyl-2'-isopropyl-biphenyl-2-yloxy)-pyrrolidin-2-ylmethyl]-4-(2,4-dioxo-thiazolidin-5-ylidenemethyl)-benzamide
TypeSmall organic molecule
Emp. Form.C49H45F2N3O6S
Mol. Mass.841.96
SMILESCC(C)Cc1cccc(c1O[C@@H]1C[C@@H](CNC(=O)c2ccc(C=C3SC(O)=NC3=O)cc2)N(C1)C(=O)c1ccccc1C(=O)c1ccc(F)cc1F)-c1ccccc1C(C)C