Reaction Details
Target5-hydroxytryptamine receptor 2A
LigandBDBM50001287
Substrate/Competitorn/a
Meas. Tech.ChEMBL_2527 (CHEMBL616877)
Ki 200±n/a nM
Citation Bromidge, SMDabbs, SDavies, DTDavies, SDuckworth, DMForbes, ITGaster, LMHam, PJones, GEKing, FDMulholland, KRSaunders, DVWyman, PABlaney, FEClarke, SEBlackburn, TPHolland, VKennett, GALightowler, SMiddlemiss, DNTrail, BRiley, GJWood, MD Biarylcarbamoylindolines are novel and selective 5-HT(2C) receptor inverse agonists: identification of 5-methyl-1-[[2-[(2-methyl-3-pyridyl)oxy]- 5-pyridyl]carbamoyl]-6-trifluoromethylindoline (SB-243213) as a potential antidepressant/anxiolytic agent. J Med Chem43:1123-34 (2000) 5-hydroxytryptamine receptor 2A
Name:5-hydroxytryptamine receptor 2A
Type:undefined
Mol. Mass.:52607.65
Organism:Homo sapiens (Human)
Description:P28223
Residue:471
BDBM50001287
NameBDBM50001287
Synonyms:CHEMBL274066
TypeSmall organic molecule
Emp. Form.C24H22F3N3O2
Mol. Mass.441.4456
SMILESCOc1cc2CCN(C(=O)Nc3cccc(c3)-c3c(C)ccnc3C)c2cc1C(F)(F)F