Reaction Details
Target5-hydroxytryptamine receptor 2A
LigandBDBM50086067
Substrate/Competitorn/a
Meas. Tech.ChEMBL_2527 (CHEMBL616877)
Ki<1000±n/a nM
Citation Bromidge, SMDabbs, SDavies, DTDavies, SDuckworth, DMForbes, ITGaster, LMHam, PJones, GEKing, FDMulholland, KRSaunders, DVWyman, PABlaney, FEClarke, SEBlackburn, TPHolland, VKennett, GALightowler, SMiddlemiss, DNTrail, BRiley, GJWood, MD Biarylcarbamoylindolines are novel and selective 5-HT(2C) receptor inverse agonists: identification of 5-methyl-1-[[2-[(2-methyl-3-pyridyl)oxy]- 5-pyridyl]carbamoyl]-6-trifluoromethylindoline (SB-243213) as a potential antidepressant/anxiolytic agent. J Med Chem43:1123-34 (2000) 5-hydroxytryptamine receptor 2A
Name:5-hydroxytryptamine receptor 2A
Type:undefined
Mol. Mass.:52607.65
Organism:Homo sapiens (Human)
Description:P28223
Residue:471
BDBM50086067
NameBDBM50086067
Synonyms:5-Methoxy-6-trifluoromethyl-2,3-dihydro-indole-1-carboxylic acid [4-chloro-3-(4-methyl-pyridin-3-yl)-phenyl]-amide | CHEMBL14362
TypeSmall organic molecule
Emp. Form.C23H19ClF3N3O2
Mol. Mass.461.864
SMILESCOc1cc2CCN(C(=O)Nc3ccc(Cl)c(c3)-c3cnccc3C)c2cc1C(F)(F)F