Reaction Details
TargetAdenosine receptor A3
LigandBDBM50086146
Substrate/Competitorn/a
Meas. Tech.ChEMBL_31868 (CHEMBL644389)
Ki 2±n/a nM
Citation Colotta, VCatarzi, DVarano, FCecchi, LFilacchioni, GMartini, CTrincavelli, LLucacchini, A 1,2,4-Triazolo[4,3-a]quinoxalin-1-one: a versatile tool for the synthesis of potent and selective adenosine receptor antagonists. J Med Chem43:1158-64 (2000) Adenosine receptor A3
Name:Adenosine receptor A3
Type:G Protein-Coupled Receptor (GPCR)
Mol. Mass.:36197.32
Organism:Homo sapiens (Human)
Description:P0DMS8
Residue:318
BDBM50086146
NameBDBM50086146
Synonyms:CHEMBL16305 N-(1-oxo-2-phenyl-1,2-dihydro-[1,2,4]triazolo[4,3-a]quinoxalin-4-yl)acetamide
TypeSmall organic molecule
Emp. Form.C17H13N5O2
Mol. Mass.319.3174
SMILESCC(=O)Nc1nc2ccccc2n2c1nn(-c1ccccc1)c2=O