Reaction Details
TargetAdenosine receptor A3
LigandBDBM50086159
Substrate/Competitorn/a
Meas. Tech.ChEMBL_31868 (CHEMBL644389)
Ki 1.47±n/a nM
Citation Colotta, VCatarzi, DVarano, FCecchi, LFilacchioni, GMartini, CTrincavelli, LLucacchini, A 1,2,4-Triazolo[4,3-a]quinoxalin-1-one: a versatile tool for the synthesis of potent and selective adenosine receptor antagonists. J Med Chem43:1158-64 (2000) Adenosine receptor A3
Name:Adenosine receptor A3
Type:G Protein-Coupled Receptor (GPCR)
Mol. Mass.:36197.32
Organism:Homo sapiens (Human)
Description:P0DMS8
Residue:318
BDBM50086159
NameBDBM50086159
Synonyms:CHEMBL16488 N-(1-oxo-2-phenyl-1,2-dihydro-[1,2,4]triazolo[4,3-a]quinoxalin-4-yl)benzamide
TypeSmall organic molecule
Emp. Form.C22H15N5O2
Mol. Mass.381.3868
SMILESO=C(Nc1nc2ccccc2n2c1nn(-c1ccccc1)c2=O)c1ccccc1