Reaction Details
TargetAdenosine receptor A1
LigandBDBM50086165
Substrate/Competitorn/a
Meas. Tech.ChEMBL_29464 (CHEMBL642193)
Ki 15.7±n/a nM
Citation Kim, YCJi, XMelman, NLinden, JJacobson, KA Anilide derivatives of an 8-phenylxanthine carboxylic congener are highly potent and selective antagonists at human A(2B) adenosine receptors. J Med Chem43:1165-72 (2000) Adenosine receptor A1
Name:Adenosine receptor A1
Type:Protein
Mol. Mass.:36704.13
Organism:Rattus norvegicus (rat)
Description:n/a
Residue:326
BDBM50086165
NameBDBM50086165
Synonyms:2-(4-(2,6-dioxo-1,3-dipropyl-2,3,6,7-tetrahydro-1H-purin-8-yl)phenoxy)-N-(4-iodophenyl)acetamide CHEMBL278039
TypeSmall organic molecule
Emp. Form.C25H26IN5O4
Mol. Mass.587.4095
SMILESCCCn1c2nc([nH]c2c(=O)n(CCC)c1=O)-c1ccc(OCC(=O)Nc2ccc(I)cc2)cc1