Reaction Details
TargetAdenosine receptor A2b
LigandBDBM50021085
Substrate/Competitorn/a
Meas. Tech.ChEMBL_4794 (CHEMBL618339)
Ki 3.71±n/a nM
Citation Kim, YCJi, XMelman, NLinden, JJacobson, KA Anilide derivatives of an 8-phenylxanthine carboxylic congener are highly potent and selective antagonists at human A(2B) adenosine receptors. J Med Chem43:1165-72 (2000) Adenosine receptor A2b
Name:Adenosine receptor A2b
Type:G Protein-Coupled Receptor (GPCR)
Mol. Mass.:36341.22
Organism:Homo sapiens (Human)
Description:n/a
Residue:332
BDBM50021085
NameBDBM50021085
Synonyms:2-[4-(2,6-Dioxo-1,3-dipropyl-2,3,6,7-tetrahydro-1H-purin-8-yl)-phenoxy]-N-(4-hydroxy-phenyl)-acetamide CHEMBL444281
TypeSmall organic molecule
Emp. Form.C25H27N5O5
Mol. Mass.477.5124
SMILESCCCn1c2nc([nH]c2c(=O)n(CCC)c1=O)-c1ccc(OCC(=O)Nc2ccc(O)cc2)cc1