Reaction Details
TargetAdenosine receptor A1
LigandBDBM50086171
Substrate/Competitorn/a
Meas. Tech.ChEMBL_29464 (CHEMBL642193)
Ki 10±n/a nM
Citation Kim, YCJi, XMelman, NLinden, JJacobson, KA Anilide derivatives of an 8-phenylxanthine carboxylic congener are highly potent and selective antagonists at human A(2B) adenosine receptors. J Med Chem43:1165-72 (2000) Adenosine receptor A1
Name:Adenosine receptor A1
Type:Protein
Mol. Mass.:36704.13
Organism:Rattus norvegicus (rat)
Description:n/a
Residue:326
BDBM50086171
NameBDBM50086171
Synonyms:4-{2-[4-(2,6-Dioxo-1,3-dipropyl-2,3,6,7-tetrahydro-1H-purin-8-yl)-phenoxy]-acetylamino}-benzamide | CHEMBL275360
TypeSmall organic molecule
Emp. Form.C26H28N6O5
Mol. Mass.504.5377
SMILESCCCn1c2nc([nH]c2c(=O)n(CCC)c1=O)-c1ccc(OCC(=O)Nc2ccc(cc2)C(N)=O)cc1