Reaction Details
TargetAdenosine receptor A2b
LigandBDBM50086165
Substrate/Competitorn/a
Meas. Tech.ChEMBL_4794 (CHEMBL618339)
Ki 2.13±n/a nM
Citation Kim, YCJi, XMelman, NLinden, JJacobson, KA Anilide derivatives of an 8-phenylxanthine carboxylic congener are highly potent and selective antagonists at human A(2B) adenosine receptors. J Med Chem43:1165-72 (2000) Adenosine receptor A2b
Name:Adenosine receptor A2b
Type:G Protein-Coupled Receptor (GPCR)
Mol. Mass.:36341.22
Organism:Homo sapiens (Human)
Description:n/a
Residue:332
BDBM50086165
NameBDBM50086165
Synonyms:2-(4-(2,6-dioxo-1,3-dipropyl-2,3,6,7-tetrahydro-1H-purin-8-yl)phenoxy)-N-(4-iodophenyl)acetamide CHEMBL278039
TypeSmall organic molecule
Emp. Form.C25H26IN5O4
Mol. Mass.587.4095
SMILESCCCn1c2nc([nH]c2c(=O)n(CCC)c1=O)-c1ccc(OCC(=O)Nc2ccc(I)cc2)cc1