Reaction Details
TargetDelta-type opioid receptor
LigandBDBM50086362
Substrate/Competitorn/a
Meas. Tech.ChEBML_145496
Ki>10000±n/a nM
Citation Allen, MPBlake, JFBryce, DKHaggan, MELiras, SMcLean, SSegelstein, BE Design, synthesis and biological evaluation of 3-amino-3-phenylpropionamide derivatives as novel mu opioid receptor ligands. Bioorg Med Chem Lett10:523-6 (2000) Delta-type opioid receptor
Name:Delta-type opioid receptor
Type:G Protein-Coupled Receptor (GPCR)
Mol. Mass.:40382.98
Organism:Homo sapiens (Human)
Description:Competition binding assays were carried out using membrane preparations from transfected HN9.10 cells that constitutively expressed the delta opioid receptor.
Residue:372
BDBM50086362
NameBDBM50086362
Synonyms:CHEMBL149143 | N-Benzyl-2,2-dimethyl-3-methylamino-3-phenyl-propionamide
TypeSmall organic molecule
Emp. Form.C19H24N2O
Mol. Mass.296.4067
SMILESCNC(c1ccccc1)C(C)(C)C(=O)NCc1ccccc1