Reaction Details
TargetKappa-type opioid receptor
LigandBDBM50086358
Substrate/Competitorn/a
Meas. Tech.ChEBML_145264
Ki 75±n/a nM
Citation Allen, MPBlake, JFBryce, DKHaggan, MELiras, SMcLean, SSegelstein, BE Design, synthesis and biological evaluation of 3-amino-3-phenylpropionamide derivatives as novel mu opioid receptor ligands. Bioorg Med Chem Lett10:523-6 (2000) Kappa-type opioid receptor
Name:Kappa-type opioid receptor
Type:G Protein-Coupled Receptor (GPCR)
Mol. Mass.:42648.76
Organism:Homo sapiens (Human)
Description:P41145
Residue:380
BDBM50086358
NameBDBM50086358
Synonyms:CHEMBL347316 | N-Cyclopropylmethyl-3-(3-hydroxy-phenyl)-2,2-dimethyl-3-methylamino-propionamide
TypeSmall organic molecule
Emp. Form.C16H24N2O2
Mol. Mass.276.374
SMILESCNC(c1cccc(O)c1)C(C)(C)C(=O)NCC1CC1