Reaction Details
TargetrRNA adenine N-6-methyltransferase
LigandBDBM50086583
Substrate/Competitorn/a
Meas. Tech.ChEBML_67532
Ki>100000±n/a nM
Citation Hanessian, SSgarbi, PW Design and synthesis of mimics of S-adenosyl-L-homocysteine as potential inhibitors of erythromycin methyltransferases. Bioorg Med Chem Lett10:433-7 (2000) rRNA adenine N-6-methyltransferase
Name:rRNA adenine N-6-methyltransferase
Type:PROTEIN
Mol. Mass.:28804.82
Organism:Streptococcus pneumoniae
Description:ChEMBL_67532
Residue:245
BDBM50086583
NameBDBM50086583
Synonyms:(2S,3R,4S,5R)-2-[4-Amino-6-(indan-2-ylamino)-[1,3,5]triazin-2-ylmethyl]-5-(4-methyl-benzyloxymethyl)-tetrahydro-furan-3,4-diol | CHEMBL436010
TypeSmall organic molecule
Emp. Form.C26H31N5O4
Mol. Mass.477.5554
SMILESCc1ccc(COC[C@H]2O[C@@H](Cc3nc(N)nc(NC4Cc5ccccc5C4)n3)[C@H](O)[C@@H]2O)cc1