Reaction Details
Target5-hydroxytryptamine receptor 1A
LigandBDBM50086856
Substrate/Competitorn/a
Meas. Tech.ChEBML_1229
Ki 4.6±n/a nM
Citation Fujio, MTogo, YTomozane, HKuroita, TMorio, YKatayama, JMatsumoto, Y N-[[1-(2-phenylethyl)pyrrolidin-2-yl]methyl]cyclohexanecarboxamides as selective 5-HT1A receptor agonists. Bioorg Med Chem Lett10:509-12 (2000) 5-hydroxytryptamine receptor 1A
Name:5-hydroxytryptamine receptor 1A
Type:G Protein-Coupled Receptor (GPCR)
Mol. Mass.:46445.29
Organism:Rattus norvegicus (rat)
Description:Binding assays were performed using rat hippocampal membranes.
Residue:422
BDBM50086856
NameBDBM50086856
Synonyms:CHEMBL147279 | N-((S)-1-Phenethyl-pyrrolidin-2-ylmethyl)-benzamide
TypeSmall organic molecule
Emp. Form.C20H24N2O
Mol. Mass.308.4174
SMILESO=C(NC[C@@H]1CCCN1CCc1ccccc1)c1ccccc1