Reaction Details
Target5-hydroxytryptamine receptor 1A
LigandBDBM50086858
Substrate/Competitorn/a
Meas. Tech.ChEBML_1229
Ki 10±n/a nM
Citation Fujio, MTogo, YTomozane, HKuroita, TMorio, YKatayama, JMatsumoto, Y N-[[1-(2-phenylethyl)pyrrolidin-2-yl]methyl]cyclohexanecarboxamides as selective 5-HT1A receptor agonists. Bioorg Med Chem Lett10:509-12 (2000) 5-hydroxytryptamine receptor 1A
Name:5-hydroxytryptamine receptor 1A
Type:G Protein-Coupled Receptor (GPCR)
Mol. Mass.:46445.29
Organism:Rattus norvegicus (rat)
Description:Binding assays were performed using rat hippocampal membranes.
Residue:422
BDBM50086858
NameBDBM50086858
Synonyms:6-Chloro-4-methyl-3,4-dihydro-2H-benzo[1,4]oxazine-8-carboxylic acid ((S)-1-phenethyl-pyrrolidin-2-ylmethyl)-amide | CHEMBL281363
TypeSmall organic molecule
Emp. Form.C23H28ClN3O2
Mol. Mass.413.94
SMILESCN1CCOc2c1cc(Cl)cc2C(=O)NC[C@@H]1CCCN1CCc1ccccc1