Reaction Details
TargetDelta-type opioid receptor
LigandBDBM50087065
Substrate/Competitorn/a
Meas. Tech.ChEMBL_217866 (CHEMBL822189)
Ki 0.39±n/a nM
Citation Darula, ZKövér, KEMonory, KBorsodi, AMakó, ERónai, ATourwé, DPéter, ATóth, G Deltorphin II analogues with 6-hydroxy-2-aminotetralin-2-carboxylic acid in position 1. J Med Chem43:1359-66 (2001) Delta-type opioid receptor
Name:Delta-type opioid receptor
Type:G Protein-Coupled Receptor (GPCR)
Mol. Mass.:40465.04
Organism:Rattus norvegicus (rat)
Description:Competition binding assays were using CHO-K1 cell membranes expressing the opioid receptor.
Residue:372
BDBM50087065
NameBDBM50087065
Synonyms:4-(2-{2-[2-Amino-3-(4-hydroxy-phenyl)-propionylamino]-propionylamino}-3-phenyl-propionylamino)-4-{1-[1-(carbamoylmethyl-carbamoyl)-2-methyl-butylcarbamoyl]-2-methyl-butylcarbamoyl}-butyric acid (Ile5,6-Deltrophin II) | CHEMBL28915
TypeSmall organic molecule
Emp. Form.C40H58N8O10
Mol. Mass.810.9361
SMILESCC[C@H](C)[C@H](NC(=O)[C@@H](NC(=O)[C@H](CCC(O)=O)NC(=O)[C@H](Cc1ccccc1)NC(=O)[C@H](C)NC(=O)[C@@H](N)Cc1ccc(O)cc1)[C@@H](C)CC)C(=O)NCC(N)=O