Reaction Details
TargetDelta-type opioid receptor
LigandBDBM50087064
Substrate/Competitorn/a
Meas. Tech.ChEMBL_217727 (CHEMBL823791)
Ki 0.34±n/a nM
Citation Darula, ZKövér, KEMonory, KBorsodi, AMakó, ERónai, ATourwé, DPéter, ATóth, G Deltorphin II analogues with 6-hydroxy-2-aminotetralin-2-carboxylic acid in position 1. J Med Chem43:1359-66 (2001) Delta-type opioid receptor
Name:Delta-type opioid receptor
Type:G Protein-Coupled Receptor (GPCR)
Mol. Mass.:40465.04
Organism:Rattus norvegicus (rat)
Description:Competition binding assays were using CHO-K1 cell membranes expressing the opioid receptor.
Residue:372
BDBM50087064
NameBDBM50087064
Synonyms:4-(2-{2-[(2-Amino-6-hydroxy-1,2,3,4-tetrahydro-naphthalene-2-carbonyl)-amino]-propionylamino}-3-phenyl-propionylamino)-4-{1-[1-(carbamoylmethyl-carbamoyl)-2-methyl-butylcarbamoyl]-2-methyl-butylcarbamoyl}-butyric acid | CHEMBL283009
TypeSmall organic molecule
Emp. Form.C42H60N8O10
Mol. Mass.836.9734
SMILESCC[C@H](C)[C@H](NC(=O)[C@@H](NC(=O)[C@H](CCC(O)=O)NC(=O)[C@H](Cc1ccccc1)NC(=O)[C@H](C)NC(=O)[C@@]1(N)CCc2cc(O)ccc2C1)[C@@H](C)CC)C(=O)NCC(N)=O