Reaction Details
TargetEpidermal growth factor receptor
LigandBDBM50077242
Substrate/Competitorn/a
Meas. Tech.ChEMBL_64445 (CHEMBL674020)
IC50 0.75±n/a nM
Citation Smaill, JBRewcastle, GWLoo, JAGreis, KDChan, OHReyner, ELLipka, EShowalter, HDVincent, PWElliott, WLDenny, WA Tyrosine kinase inhibitors. 17. Irreversible inhibitors of the epidermal growth factor receptor: 4-(phenylamino)quinazoline- and 4-(phenylamino)pyrido[3,2-d]pyrimidine-6-acrylamides bearing additional solubilizing functions. J Med Chem43:1380-97 (2001) Epidermal growth factor receptor
Name:Epidermal growth factor receptor
Type:Receptor Kinase Domain
Mol. Mass.:134279.59
Organism:Homo sapiens (Human)
Description:P00533
Residue:1210
BDBM50077242
NameBDBM50077242
Synonyms:CHEMBL31373 | N-[4-(3-Chloro-4-fluoro-phenylamino)-quinazolin-6-yl]-acrylamide
TypeSmall organic molecule
Emp. Form.C17H12ClFN4O
Mol. Mass.342.755
SMILESFc1ccc(Nc2ncnc3ccc(NC(=O)C=C)cc23)cc1Cl