Reaction Details
TargetAlpha-2A adrenergic receptor [16-465]
LigandBDBM50016897
Substrate/Competitorn/a
Meas. Tech.ChEMBL_33684 (CHEMBL647841)
Ki 0.39±n/a nM
Citation Ross, TMJetter, MCMcDonnell, MEBoyd, REConnelly, CDMartinez, RPLewis, MACodd, EERaffa, RBReitz, AB Alpha(2) adrenoceptor agonists as potential analgesic agents. 2. Discovery of 4-(4-imidazo)-1,3-dimethyl-6,7-dihydro-thianaphthene as a high-affinity ligand for the alpha(2D) adrenergic receptor. J Med Chem43:1423-6 (2001) Alpha-2A adrenergic receptor [16-465]
Name:Alpha-2A adrenergic receptor [16-465]
Type:G-protein coupled receptor
Mol. Mass.:48961.69
Organism:Rattus norvegicus (rat)
Description:P22909[16-465]
Residue:450
BDBM50016897
NameBDBM50016897
Synonyms:2-(2,6-dichloroanilino)-1,3-diazacyclopentene-(2) CLONIDINE clonidine (amino form)
TypeSmall organic molecule
Emp. Form.C9H9Cl2N3
Mol. Mass.230.094
SMILESClc1cccc(Cl)c1\[#7]=[#6]-1\[#7]-[#6]-[#6]-[#7]-1