Reaction Details
TargetRetinoic acid receptor alpha
LigandBDBM31883
Substrate/Competitorn/a
Meas. Tech.ChEBML_195317
IC50 0.780000±n/a nM
Citation Kikuchi, KHibi, SYoshimura, HTai, KHida, TTokuhara, NYamauchi, TNagai, M Novel retinoic acid receptor alpha agonists: syntheses and evaluation of pyrazole derivatives. Bioorg Med Chem Lett10:619-22 (2000) Retinoic acid receptor alpha
Name:Retinoic acid receptor alpha
Type:PROTEIN
Mol. Mass.:50778.87
Organism:Homo sapiens (Human)
Description:ChEMBL_1466191
Residue:462
BDBM31883
NameBDBM31883
Synonyms:9-cis-retinoic acid (9cRA) AT-RA CHEMBL38 SMR000058245 Vitamin A acid [3H]Retinoic acid [3H]tretinoin cid_444795
Typeradiolabeled ligand
Emp. Form.C20H28O2
Mol. Mass.300.4351
SMILESC\C(\C=C\C1=C(C)CCCC1(C)C)=C/C=C/C(/C)=C/C(O)=O