Reaction Details
TargetProtein kinase C alpha type
LigandBDBM50087240
Substrate/Competitorn/a
Meas. Tech.ChEBML_160293
Ki 87±n/a nM
Citation Nacro, KBienfait, BLewin, NEBlumberg, PMMarquez, VE Diacylglycerols with lipophilically equivalent branched acyl chains display high affinity for protein kinase C (PK-C). A direct measure of the effect of constraining the glycerol backbone in DAG lactones. Bioorg Med Chem Lett10:653-5 (2000) Protein kinase C alpha type
Name:Protein kinase C alpha type
Type:Enzyme
Mol. Mass.:76755.65
Organism:Homo sapiens (Human)
Description:The recombinant human PKC enzymes were produced using a baculovirus expression system in SF9 cells
Residue:672
BDBM50087240
NameBDBM50087240
Synonyms:(E)-Octadec-9-enoic acid (S)-1-hydroxymethyl-2-((E)-octadec-9-enoyloxy)-ethyl ester Octadec-9-enoic acid 1-hydroxymethyl-2-octadec-9-enoyloxy-ethyl ester(DIOLEIN)
TypeSmall organic molecule
Emp. Form.C39H72O5
Mol. Mass.620.986
SMILESCCCCCCCC\C=C\CCCCCCCC(=O)OC[C@H](CO)OC(=O)CCCCCCC\C=C\CCCCCCCC