Reaction Details
TargetAdenosine deaminase
LigandBDBM50087365
Substrate/Competitorn/a
Meas. Tech.ChEMBL_7177 (CHEMBL620221)
Ki 50±n/a nM
Citation Kasibhatla, SRBookser, BCProbst, GAppleman, JRErion, MD AMP deaminase inhibitors. 3. SAR of 3-(carboxyarylalkyl)coformycin aglycon analogues. J Med Chem43:1508-18 (2000) Adenosine deaminase
Name:Adenosine deaminase
Type:Enzyme
Mol. Mass.:40910.44
Organism:Bos taurus (bovine)
Description:n/a
Residue:363
BDBM50087365
NameBDBM50087365
Synonyms:3-[3-(2-methyl-5-{[(methylamino)oxy]carbonyl}phenyl)propyl]-3,6,7,8-tetrahydroimidazo[4,5-d][1,3]diazepin-8-ol (1.05H2O) | CHEMBL36986
TypeSmall organic molecule
Emp. Form.C18H23N5O3
Mol. Mass.357.4069
SMILESCNOC(=O)c1ccc(C)c(CCCn2cnc3C(O)CNC=Nc23)c1