Reaction Details
TargetAdenosine deaminase
LigandBDBM50087364
Substrate/Competitorn/a
Meas. Tech.ChEMBL_30792 (CHEMBL873051)
Ki 60±n/a nM
Citation Kasibhatla, SRBookser, BCProbst, GAppleman, JRErion, MD AMP deaminase inhibitors. 3. SAR of 3-(carboxyarylalkyl)coformycin aglycon analogues. J Med Chem43:1508-18 (2000) Adenosine deaminase
Name:Adenosine deaminase
Type:Enzyme
Mol. Mass.:40910.44
Organism:Bos taurus (bovine)
Description:n/a
Residue:363
BDBM50087364
NameBDBM50087364
Synonyms:2-[3-(8-Hydroxy-7,8-dihydro-6H-imidazo[4,5-d][1,3]diazepin-3-yl)-propyl]-4-methyl-benzoic acid methyl ester | CHEMBL290111
TypeSmall organic molecule
Emp. Form.C18H22N4O3
Mol. Mass.342.3923
SMILESCOC(=O)c1ccc(C)cc1CCCn1cnc2C(O)CNC=Nc12