Reaction Details
TargetAdenosine deaminase
LigandBDBM50087351
Substrate/Competitorn/a
Meas. Tech.ChEMBL_30792 (CHEMBL873051)
Ki 160±n/a nM
Citation Kasibhatla, SRBookser, BCProbst, GAppleman, JRErion, MD AMP deaminase inhibitors. 3. SAR of 3-(carboxyarylalkyl)coformycin aglycon analogues. J Med Chem43:1508-18 (2000) Adenosine deaminase
Name:Adenosine deaminase
Type:Enzyme
Mol. Mass.:40910.44
Organism:Bos taurus (bovine)
Description:n/a
Residue:363
BDBM50087351
NameBDBM50087351
Synonyms:2-[3-(8-Hydroxy-7,8-dihydro-6H-imidazo[4,5-d][1,3]diazepin-3-yl)-propyl]-benzoic acid methyl ester (0.25H2O) | CHEMBL290030
TypeSmall organic molecule
Emp. Form.C17H20N4O3
Mol. Mass.328.3657
SMILESCOC(=O)c1ccccc1CCCn1cnc2C(O)CNC=Nc12