Reaction Details
TargetAMP deaminase 3
LigandBDBM50087407
Substrate/Competitorn/a
Meas. Tech.ChEMBL_28867 (CHEMBL644199)
Ki 40±n/a nM
Citation Bookser, BCKasibhatla, SRErion, MD AMP deaminase inhibitors. 4. Further N3-substituted coformycin aglycon analogues: N3-alkylmalonates as ribose 5'-monophosphate mimetics. J Med Chem43:1519-24 (2000) AMP deaminase 3
Name:AMP deaminase 3
Type:Protein
Mol. Mass.:88818.80
Organism:Homo sapiens (Human)
Description:n/a
Residue:767
BDBM50087407
NameBDBM50087407
Synonyms:2-[4-(8-Hydroxy-7,8-dihydro-6H-imidazo[4,5-d][1,3]diazepin-3-yl)-butyl]-2-(4-trifluoromethyl-benzyl)-malonic acid (2H2O) | CHEMBL289398
TypeSmall organic molecule
Emp. Form.C21H23F3N4O5
Mol. Mass.468.4263
SMILESOC1CNC=Nc2c1ncn2CCCCC(Cc1ccc(cc1)C(F)(F)F)(C(O)=O)C(O)=O