Reaction Details
TargetAlpha-1A adrenergic receptor
LigandBDBM50087493
Substrate/Competitorn/a
Meas. Tech.ChEMBL_34033 (CHEMBL646286)
Ki 0.49±n/a nM
Citation Meyer, MDAltenbach, RJBasha, FZCarroll, WACondon, SElmore, SWKerwin, JFSippy, KBTietje, KWendt, MDHancock, AABrune, MEBuckner, SADrizin, I Structure-activity studies for a novel series of tricyclic substituted hexahydrobenz[e]isoindole alpha(1A) adrenoceptor antagonists as potential agents for the symptomatic treatment of benign prostatic hyperplasia (BPH). J Med Chem43:1586-603 (2000) Alpha-1A adrenergic receptor
Name:Alpha-1A adrenergic receptor
Type:Protein
Mol. Mass.:51620.15
Organism:Rattus norvegicus (Rat)
Description:P43140
Residue:466
BDBM50087493
NameBDBM50087493
Synonyms:7-[2-(6-Methoxy-1,3,3a,4,5,9b-hexahydro-benzo[e]isoindol-2-yl)-ethyl]-2-methyl-5H-9-thia-1,4,5,7-tetraaza-fluorene-6,8-dione | CHEMBL297218
TypeSmall organic molecule
Emp. Form.C24H25N5O3S
Mol. Mass.463.552
SMILESCOc1cccc2[C@@H]3CN(CCn4c(=O)[nH]c5c6ncc(C)nc6sc5c4=O)C[C@@H]3CCc12