Reaction Details
TargetAlpha-1D adrenergic receptor
LigandBDBM50087496
Substrate/Competitorn/a
Meas. Tech.ChEMBL_32731 (CHEMBL646002)
Ki 0.31±n/a nM
Citation Meyer, MDAltenbach, RJBasha, FZCarroll, WACondon, SElmore, SWKerwin, JFSippy, KBTietje, KWendt, MDHancock, AABrune, MEBuckner, SADrizin, I Structure-activity studies for a novel series of tricyclic substituted hexahydrobenz[e]isoindole alpha(1A) adrenoceptor antagonists as potential agents for the symptomatic treatment of benign prostatic hyperplasia (BPH). J Med Chem43:1586-603 (2000) Alpha-1D adrenergic receptor
Name:Alpha-1D adrenergic receptor
Type:Protein
Mol. Mass.:59375.97
Organism:Rattus norvegicus (Rat)
Description:P23944
Residue:561
BDBM50087496
NameBDBM50087496
Synonyms:8-Chloro-3-[2-(6-methoxy-1,3,3a,4,5,9b-hexahydro-benzo[e]isoindol-2-yl)-ethyl]-1H-benzo[4,5]thieno[3,2-d]pyrimidine-2,4-dione | CHEMBL41444
TypeSmall organic molecule
Emp. Form.C25H24ClN3O3S
Mol. Mass.481.994
SMILESCOc1cccc2[C@@H]3CN(CCn4c(=O)[nH]c5c6cc(Cl)ccc6sc5c4=O)C[C@@H]3CCc12