Reaction Details
TargetAlpha-1A adrenergic receptor
LigandBDBM50087485
Substrate/Competitorn/a
Meas. Tech.ChEMBL_34033 (CHEMBL646286)
Ki 0.33±n/a nM
Citation Meyer, MDAltenbach, RJBasha, FZCarroll, WACondon, SElmore, SWKerwin, JFSippy, KBTietje, KWendt, MDHancock, AABrune, MEBuckner, SADrizin, I Structure-activity studies for a novel series of tricyclic substituted hexahydrobenz[e]isoindole alpha(1A) adrenoceptor antagonists as potential agents for the symptomatic treatment of benign prostatic hyperplasia (BPH). J Med Chem43:1586-603 (2000) Alpha-1A adrenergic receptor
Name:Alpha-1A adrenergic receptor
Type:Protein
Mol. Mass.:51620.15
Organism:Rattus norvegicus (Rat)
Description:P43140
Residue:466
BDBM50087485
NameBDBM50087485
Synonyms:2-[2-(6-Methoxy-1,3,3a,4,5,9b-hexahydro-benzo[e]isoindol-2-yl)-ethyl]-4H-9-thia-2,4,6-triaza-fluorene-1,3-dione CHEMBL287965
TypeSmall organic molecule
Emp. Form.C24H24N4O3S
Mol. Mass.448.537
SMILESCOc1cccc2[C@@H]3CN(CCn4c(=O)[nH]c5c6cnccc6sc5c4=O)C[C@@H]3CCc12