Reaction Details
TargetProthrombin
LigandBDBM50087537
Substrate/Competitorn/a
Meas. Tech.ChEBML_209232
Ki 5700±n/a nM
Citation Pruitt, JRPinto, DJEstrella, MJBostrom, LLKnabb, RMWong, PCWright, MRWexler, RR Isoxazolines and isoxazoles as factor Xa inhibitors. Bioorg Med Chem Lett10:685-9 (2000) Prothrombin
Name:Prothrombin
Type:Protein
Mol. Mass.:70029.57
Organism:Homo sapiens (Human)
Description:P00734
Residue:622
BDBM50087537
NameBDBM50087537
Synonyms:(4S,5S)-3-(3-Carbamimidoyl-phenyl)-5-tetrazol-1-ylmethyl-4,5-dihydro-isoxazole-4-carboxylic acid (2'-sulfamoyl-biphenyl-4-yl)-amide | CHEMBL347838
TypeSmall organic molecule
Emp. Form.C25H23N9O4S
Mol. Mass.545.573
SMILESNC(=N)c1cccc(c1)C1=NO[C@H](Cn2cnnn2)[C@H]1C(=O)Nc1ccc(cc1)-c1ccccc1S(N)(=O)=O