Reaction Details
TargetProthrombin
LigandBDBM50087538
Substrate/Competitorn/a
Meas. Tech.ChEBML_209232
Ki 4600±n/a nM
Citation Pruitt, JRPinto, DJEstrella, MJBostrom, LLKnabb, RMWong, PCWright, MRWexler, RR Isoxazolines and isoxazoles as factor Xa inhibitors. Bioorg Med Chem Lett10:685-9 (2000) Prothrombin
Name:Prothrombin
Type:Protein
Mol. Mass.:70029.57
Organism:Homo sapiens (Human)
Description:P00734
Residue:622
BDBM50087538
NameBDBM50087538
Synonyms:(4S,5S)-3-(3-Carbamimidoyl-phenyl)-5-methoxymethyl-4,5-dihydro-isoxazole-4-carboxylic acid (2'-sulfamoyl-biphenyl-4-yl)-amide | CHEMBL351688
TypeSmall organic molecule
Emp. Form.C25H25N5O5S
Mol. Mass.507.562
SMILESCOC[C@H]1ON=C([C@@H]1C(=O)Nc1ccc(cc1)-c1ccccc1S(N)(=O)=O)c1cccc(c1)C(N)=N