Reaction Details
TargetCoagulation factor X
LigandBDBM50087534
Substrate/Competitorn/a
Meas. Tech.ChEBML_48820
Ki 9.5±n/a nM
Citation Pruitt, JRPinto, DJEstrella, MJBostrom, LLKnabb, RMWong, PCWright, MRWexler, RR Isoxazolines and isoxazoles as factor Xa inhibitors. Bioorg Med Chem Lett10:685-9 (2000) Coagulation factor X
Name:Coagulation factor X
Type:Enzyme
Mol. Mass.:54726.60
Organism:Homo sapiens (Human)
Description:n/a
Residue:488
BDBM50087534
NameBDBM50087534
Synonyms:3-(3-Carbamimidoyl-phenyl)-5-trifluoromethyl-isoxazole-4-carboxylic acid (2'-sulfamoyl-biphenyl-4-yl)-amide | CHEMBL351830
TypeSmall organic molecule
Emp. Form.C24H18F3N5O4S
Mol. Mass.529.491
SMILESNC(=N)c1cccc(c1)-c1noc(c1C(=O)Nc1ccc(cc1)-c1ccccc1S(N)(=O)=O)C(F)(F)F