Reaction Details
TargetSerine protease 1
LigandBDBM50087528
Substrate/Competitorn/a
Meas. Tech.ChEBML_212523
Ki 117±n/a nM
Citation Pruitt, JRPinto, DJEstrella, MJBostrom, LLKnabb, RMWong, PCWright, MRWexler, RR Isoxazolines and isoxazoles as factor Xa inhibitors. Bioorg Med Chem Lett10:685-9 (2000) Serine protease 1
Name:Serine protease 1
Type:Enzyme
Mol. Mass.:25790.52
Organism:Bos taurus (bovine)
Description:P00760
Residue:246
BDBM50087528
NameBDBM50087528
Synonyms:5-Amino-3-(3-carbamimidoyl-phenyl)-isoxazole-4-carboxylic acid (2'-sulfamoyl-biphenyl-4-yl)-amide | CHEMBL352197
TypeSmall organic molecule
Emp. Form.C23H20N6O4S
Mol. Mass.476.508
SMILESNC(=N)c1cccc(c1)-c1noc(N)c1C(=O)Nc1ccc(cc1)-c1ccccc1S(N)(=O)=O