Reaction Details
TargetCorticotropin-releasing factor receptor 1
LigandBDBM50074501
Substrate/Competitorn/a
Meas. Tech.ChEBML_51284
Ki 2.5±n/a nM
Citation Hsin, LWWebster, ELChrousos, GPGold, PWEckelman, WCContoreggi, CRice, KC Synthesis and biological activity of fluoro-substituted pyrrolo[2,3-d]pyrimidines: the development of potential positron emission tomography imaging agents for the corticotropin-releasing hormone type 1 receptor. Bioorg Med Chem Lett10:707-10 (2000) Corticotropin-releasing factor receptor 1
Name:Corticotropin-releasing factor receptor 1
Type:G Protein-Coupled Receptor (GPCR)
Mol. Mass.:47870.75
Organism:Rattus norvegicus (rat)
Description:Receptor binding assays were performed using rat cortex homogenate.
Residue:415
BDBM50074501
NameBDBM50074501
Synonyms:Butyl-ethyl-[2,5,6-trimethyl-7-(2,4,6-trimethyl-phenyl)-7H-pyrrolo[2,3-d]pyrimidin-4-yl]-amine CHEMBL296641
TypeSmall organic molecule
Emp. Form.C24H34N4
Mol. Mass.378.5536
SMILESCCCCN(CC)c1nc(C)nc2n(c(C)c(C)c12)-c1c(C)cc(C)cc1C