Reaction Details
TargetCoagulation factor X
LigandBDBM50087638
Substrate/Competitorn/a
Meas. Tech.ChEBML_48807
IC50 0.900000±n/a nM
Citation Tamura, SYLevy, OEUong, THReiner, JEGoldman, EAHo, JZCohen, CRBergum, PWNutt, RFBrunck, TKSemple, JE Guanylpiperidine peptidomimetics: potent and selective bis-cation inhibitors of factor Xa. Bioorg Med Chem Lett10:745-9 (2000) Coagulation factor X
Name:Coagulation factor X
Type:Enzyme
Mol. Mass.:54726.60
Organism:Homo sapiens (Human)
Description:n/a
Residue:488
BDBM50087638
NameBDBM50087638
Synonyms:(R)-5-Guanidino-2-phenylmethanesulfonylamino-pentanoic acid [((S)-1-carbamimidoyl-2-hydroxy-piperidin-3-ylcarbamoyl)-methyl]-amide; TFA | CHEMBL423823
TypeSmall organic molecule
Emp. Form.C21H35N9O5S
Mol. Mass.525.625
SMILESNC(=N)NCCC[C@@H](NS(=O)(=O)Cc1ccccc1)C(=O)NCC(=O)N[C@H]1CCCN(C1O)C(N)=N