Reaction Details
TargetCoagulation factor X
LigandBDBM50087645
Substrate/Competitorn/a
Meas. Tech.ChEMBL_48807 (CHEMBL662832)
Ki 16±n/a nM
Citation Tamura, SYLevy, OEUong, THReiner, JEGoldman, EAHo, JZCohen, CRBergum, PWNutt, RFBrunck, TKSemple, JE Guanylpiperidine peptidomimetics: potent and selective bis-cation inhibitors of factor Xa. Bioorg Med Chem Lett10:745-9 (2000) Coagulation factor X
Name:Coagulation factor X
Type:Enzyme
Mol. Mass.:54726.60
Organism:Homo sapiens (Human)
Description:n/a
Residue:488
BDBM50087645
NameBDBM50087645
Synonyms:4-{2-[(R)-1-{[((S)-1-Carbamimidoyl-2-hydroxy-piperidin-3-ylcarbamoyl)-methyl]-carbamoyl}-2-(1-carbamimidoyl-piperidin-4-yl)-ethylcarbamoyloxy]-ethyl}-benzoic acid ethyl ester; TFA | CHEMBL164418
TypeSmall organic molecule
Emp. Form.C29H45N9O7
Mol. Mass.631.7237
SMILESCCOC(=O)c1ccc(CCOC(=O)N[C@H](CC2CCN(CC2)C(N)=N)C(=O)NCC(=O)N[C@H]2CCCN(C2O)C(N)=N)cc1