Reaction Details
TargetVasopressin V2 receptor
LigandBDBM50087670
Substrate/Competitorn/a
Meas. Tech.ChEBML_214705
IC50 1.3±n/a nM
Citation Ashwell, MABagli, JFCaggiano, TJChan, PSMolinari, AJPalka, CPark, CHRogers, JFSherman, MTrybulski, EJWilliams, DK The design, synthesis and physical chemical properties of novel human vasopressin V2-receptor antagonists optimized for parenteral delivery. Bioorg Med Chem Lett10:783-6 (2000) Vasopressin V2 receptor
Name:Vasopressin V2 receptor
Type:Receptor
Mol. Mass.:40295.28
Organism:Homo sapiens (Human)
Description:P30518
Residue:371
BDBM50087670
NameBDBM50087670
Synonyms:Biphenyl-2-carboxylic acid {3-chloro-4-[3-(4-methyl-piperazin-1-ylmethyl)-5H,11H-benzo[e]pyrrolo[1,2-a][1,4]diazepine-10-carbonyl]-phenyl}-amide | CHEMBL165340
TypeSmall organic molecule
Emp. Form.C38H36ClN5O2
Mol. Mass.630.178
SMILESCN1CCN(Cc2ccc3CN(C(=O)c4ccc(NC(=O)c5ccccc5-c5ccccc5)cc4Cl)c4ccccc4Cn23)CC1