Reaction Details
TargetGenome polyprotein
LigandBDBM50087768
Substrate/Competitorn/a
Meas. Tech.ChEMBL_76921 (CHEMBL688665)
EC50>15000±n/a nM
Citation Reich, SHJohnson, TWallace, MBKephart, SEFuhrman, SAWorland, STMatthews, DAHendrickson, TFChan, FMeador, JFerre, RABrown, ELDeLisle, DMPatick, AKBinford, SLFord, CE Substituted benzamide inhibitors of human rhinovirus 3C protease: structure-based design, synthesis, and biological evaluation. J Med Chem43:1670-83 (2000) Genome polyprotein
Name:Genome polyprotein
Type:PROTEIN
Mol. Mass.:44361.04
Organism:Human rhinovirus B
Description:ChEMBL_158953
Residue:401
BDBM50087768
NameBDBM50087768
Synonyms:3-[3-(4-Dimethylamino-phenyl)-3-oxo-propenyl]-benzamide | CHEMBL43771
TypeSmall organic molecule
Emp. Form.C18H18N2O2
Mol. Mass.294.3477
SMILESCN(C)c1ccc(cc1)C(=O)\C=C\c1cccc(c1)C(N)=O