Reaction Details
TargetAmine oxidase [flavin-containing] A
LigandBDBM50087789
Substrate/Competitorn/a
Meas. Tech.ChEMBL_123446 (CHEMBL731837)
Ki 87000±n/a nM
Citation Morón, JACampillo, MPerez, VUnzeta, MPardo, L Molecular determinants of MAO selectivity in a series of indolylmethylamine derivatives: biological activities, 3D-QSAR/CoMFA analysis, and computational simulation of ligand recognition. J Med Chem43:1684-91 (2000) Amine oxidase [flavin-containing] A
Name:Amine oxidase [flavin-containing] A
Type:Enzyme
Mol. Mass.:59515.21
Organism:Rattus norvegicus (rat)
Description:n/a
Residue:526
BDBM50087789
NameBDBM50087789
Synonyms:Benzyl-(1H-indol-2-ylmethyl)-amine (FA4) N-((1H-indol-2-yl)methyl)(phenyl)methanamine
TypeSmall organic molecule
Emp. Form.C16H16N2
Mol. Mass.236.3116
SMILESC(NCc1ccccc1)c1cc2ccccc2[nH]1