Reaction Details
TargetAmine oxidase [flavin-containing] B
LigandBDBM50087794
Substrate/Competitorn/a
Meas. Tech.ChEMBL_124404 (CHEMBL878130)
Ki 30±n/a nM
Citation Morón, JACampillo, MPerez, VUnzeta, MPardo, L Molecular determinants of MAO selectivity in a series of indolylmethylamine derivatives: biological activities, 3D-QSAR/CoMFA analysis, and computational simulation of ligand recognition. J Med Chem43:1684-91 (2000) Amine oxidase [flavin-containing] B
Name:Amine oxidase [flavin-containing] B
Type:Enzyme
Mol. Mass.:58469.65
Organism:Rattus norvegicus (rat)
Description:P19643
Residue:520
BDBM50087794
NameBDBM50087794
Synonyms:But-2-ynyl-methyl-(1-methyl-1H-indol-2-ylmethyl)-amine (FA30) | CHEMBL416467
TypeSmall organic molecule
Emp. Form.C15H18N2
Mol. Mass.226.3168
SMILESCC#CCN(C)Cc1cc2ccccc2n1C