Reaction Details
TargetAmine oxidase [flavin-containing] B
LigandBDBM50087799
Substrate/Competitorn/a
Meas. Tech.ChEMBL_124404 (CHEMBL878130)
Ki 362000±n/a nM
Citation Morón, JACampillo, MPerez, VUnzeta, MPardo, L Molecular determinants of MAO selectivity in a series of indolylmethylamine derivatives: biological activities, 3D-QSAR/CoMFA analysis, and computational simulation of ligand recognition. J Med Chem43:1684-91 (2000) Amine oxidase [flavin-containing] B
Name:Amine oxidase [flavin-containing] B
Type:Enzyme
Mol. Mass.:58469.65
Organism:Rattus norvegicus (rat)
Description:P19643
Residue:520
BDBM50087799
NameBDBM50087799
Synonyms:Benzyl-(1-benzyl-1H-indol-3-ylmethyl)-amine (FA207) | CHEMBL47667
TypeSmall organic molecule
Emp. Form.C23H22N2
Mol. Mass.326.4342
SMILESC(NCc1ccccc1)c1cn(Cc2ccccc2)c2ccccc12