Reaction Details
TargetAmine oxidase [flavin-containing] A
LigandBDBM50087807
Substrate/Competitorn/a
Meas. Tech.ChEMBL_123446 (CHEMBL731837)
Ki 5250±n/a nM
Citation Morón, JACampillo, MPerez, VUnzeta, MPardo, L Molecular determinants of MAO selectivity in a series of indolylmethylamine derivatives: biological activities, 3D-QSAR/CoMFA analysis, and computational simulation of ligand recognition. J Med Chem43:1684-91 (2000) Amine oxidase [flavin-containing] A
Name:Amine oxidase [flavin-containing] A
Type:Enzyme
Mol. Mass.:59515.21
Organism:Rattus norvegicus (rat)
Description:n/a
Residue:526
BDBM50087807
NameBDBM50087807
Synonyms:(5-Benzyloxy-1H-indol-2-ylmethyl)-but-2-ynyl-amine | CHEMBL44430
TypeSmall organic molecule
Emp. Form.C20H20N2O
Mol. Mass.304.3856
SMILESCC#CCNCc1cc2cc(OCc3ccccc3)ccc2[nH]1