Reaction Details
TargetAmine oxidase [flavin-containing] A
LigandBDBM50087803
Substrate/Competitorn/a
Meas. Tech.ChEMBL_123446 (CHEMBL731837)
Ki 4±n/a nM
Citation Morón, JACampillo, MPerez, VUnzeta, MPardo, L Molecular determinants of MAO selectivity in a series of indolylmethylamine derivatives: biological activities, 3D-QSAR/CoMFA analysis, and computational simulation of ligand recognition. J Med Chem43:1684-91 (2000) Amine oxidase [flavin-containing] A
Name:Amine oxidase [flavin-containing] A
Type:Enzyme
Mol. Mass.:59515.21
Organism:Rattus norvegicus (rat)
Description:n/a
Residue:526
BDBM50087803
NameBDBM50087803
Synonyms:1-Methyl-2-[(methyl-prop-2-ynyl-amino)-methyl]-1H-indol-5-ol (FA69) | CHEMBL45765
TypeSmall organic molecule
Emp. Form.C14H16N2O
Mol. Mass.228.2896
SMILESCN(CC#C)Cc1cc2cc(O)ccc2n1C