Reaction Details
TargetAmine oxidase [flavin-containing] A
LigandBDBM50087800
Substrate/Competitorn/a
Meas. Tech.ChEMBL_123446 (CHEMBL731837)
Ki 790.0±n/a nM
Citation Morón, JACampillo, MPerez, VUnzeta, MPardo, L Molecular determinants of MAO selectivity in a series of indolylmethylamine derivatives: biological activities, 3D-QSAR/CoMFA analysis, and computational simulation of ligand recognition. J Med Chem43:1684-91 (2000) Amine oxidase [flavin-containing] A
Name:Amine oxidase [flavin-containing] A
Type:Enzyme
Mol. Mass.:59515.21
Organism:Rattus norvegicus (rat)
Description:n/a
Residue:526
BDBM50087800
NameBDBM50087800
Synonyms:(5-Benzyloxy-1H-indol-2-ylmethyl)-prop-2-ynyl-amine | CHEMBL45069
TypeSmall organic molecule
Emp. Form.C19H18N2O
Mol. Mass.290.359
SMILESC#CCNCc1cc2cc(OCc3ccccc3)ccc2[nH]1